BDBM50225516 CHEMBL156326
SMILES NCCCNCC(O)c1ccc(O)c(O)c1
InChI Key InChIKey=PJAFJAWMDBHLFV-UHFFFAOYSA-N
Data  1 EC50
  Tab Delimited (TSV)   2D SDfile   Computed 3D by Vconf -m prep SDfile
Find this compound or compounds like it in BindingDB:
Activity Spreadsheet -- Enzyme Inhibition Constant Data from BindingDB
Found 1 hit for monomerid = 50225516
TargetBeta-1 adrenergic receptor(Mus musculus)
TBA
Curated by ChEMBL
LigandPNGBDBM50225516(CHEMBL156326)
Affinity DataEC50:  1.60E+5nM. Assay description: Effective concentration against 125I]iodocyanopindolol(ICYP) binding to beta adrenergic receptor was determined
In DepthDetails ArticlePubMed