BDBM50225931 CHEMBL3038191
SMILES [H][C@@]12Oc3c4c(C[C@@]5([H])N(CCC)CC[C@@]14[C@]51C[C@H](NC(=O)\C=C\C(=O)OC)[C@]2(OC)C=C1)ccc3O
InChI Key InChIKey=XPZPICNKLZXHCW-GLJOZLSGSA-N
Data  1 EC50
  Tab Delimited (TSV)   2D SDfile   Computed 3D by Vconf -m prep SDfile
Find this compound or compounds like it in BindingDB:
Activity Spreadsheet -- Enzyme Inhibition Constant Data from BindingDB
Found 1 hit for monomerid = 50225931
LigandPNGBDBM50225931(CHEMBL3038191)
Affinity DataEC50:  180nM. Assay description: Displacement of [3H]dalamid ([D-Ala2,Met5] enkephalinamide) from opioid receptors of rat brain membrane
In DepthDetails ArticlePubMed