BDBM50225938 CHEMBL2310919
SMILES OC(=O)C(O)=O.[H][C@@]12Oc3c4c(C[C@@]5([H])N(CC=C)CC[C@@]14[C@]51C[C@H](N=S)C2(OC)C=C1)ccc3O
InChI Key InChIKey=JIBAJFBVXOHFNE-ISQFUXSMSA-N
Data  1 EC50
  Tab Delimited (TSV)   2D SDfile   Computed 3D by Vconf -m prep SDfile
Find this compound or compounds like it in BindingDB:
Activity Spreadsheet -- Enzyme Inhibition Constant Data from BindingDB
Found 1 hit for monomerid = 50225938
LigandPNGBDBM50225938(CHEMBL2310919)
Affinity DataEC50:  100nM. Assay description: Displacement of [3H]dalamid ([D-Ala2,Met5] enkephalinamide) from opioid receptors of rat brain membrane
In DepthDetails ArticlePubMed