BDBM50226299 CHEMBL3142798
SMILES CCC[C@H](NC(=O)[C@H](Cc1ccccc1)NC(=O)OC(C)(C)C)C(=O)N[C@@H](CC(C)C)[C@@H](O)CC(=O)N[C@@H](C)C(=O)N[C@@H](CC(C)C)[C@@H](O)CC(=O)OC
InChI Key InChIKey=BTIJRGLHWQSSBG-CXZRMZRFSA-N
Data  2 IC50
  Tab Delimited (TSV)   2D SDfile   Computed 3D by Vconf -m prep SDfile
Find this compound or compounds like it in BindingDB:
Activity Spreadsheet -- Enzyme Inhibition Constant Data from BindingDB
Found 2 hits for monomerid = 50226299
TargetRenin(Homo sapiens (Human))
TBA
Curated by ChEMBL
LigandPNGBDBM50226299(CHEMBL3142798)
Affinity DataIC50:  510nM. Assay description: In vitro inhibitory activity against human plasma renin
In DepthDetails ArticlePubMed
TargetRenin(Homo sapiens (Human))
TBA
Curated by ChEMBL
LigandPNGBDBM50226299(CHEMBL3142798)
Affinity DataIC50:  51nM. Assay description: Inhibition of human plasma renin
In DepthDetails ArticlePubMed