BDBM50227724 CHEMBL400083::N-hydroxy-2-methyl-2-{4-[2-methyl-3'-(2-methylamino-ethoxy)-biphenyl-4-yl]-piperidine-1-sulfonyl}-propionamide
SMILES CNCCOc1cccc(c1)-c1ccc(cc1C)C1CCN(CC1)S(=O)(=O)C(C)(C)C(=O)NO
InChI Key InChIKey=SBUWCTGSDDXCCA-UHFFFAOYSA-N
Data  2 IC50
  Tab Delimited (TSV)   2D SDfile   Computed 3D by Vconf -m prep SDfile
Find this compound or compounds like it in BindingDB:
Activity Spreadsheet -- Enzyme Inhibition Constant Data from BindingDB
Found 2 hits for monomerid = 50227724
TargetStromelysin-1(Homo sapiens (Human))
Pfizer
Curated by ChEMBL
LigandPNGBDBM50227724(CHEMBL400083 | N-hydroxy-2-methyl-2-{4-[2-methyl-3...)
Affinity DataIC50:  0.300nM. Assay description: Inhibition of MMP3
In DepthDetails ArticlePubMed
Target72 kDa type IV collagenase(Homo sapiens (Human))
Pfizer
Curated by ChEMBL
LigandPNGBDBM50227724(CHEMBL400083 | N-hydroxy-2-methyl-2-{4-[2-methyl-3...)
Affinity DataIC50:  196nM. Assay description: Inhibition of MMP2
In DepthDetails ArticlePubMed