BDBM50228140 2-(2-isopropylphenoxy)-1-morpholinoethanone::CHEMBL236140
SMILES CC(C)c1ccccc1OCC(=O)N1CCOCC1
InChI Key InChIKey=JJFUBSKQYPNMPA-UHFFFAOYSA-N
Data  1 Kd
  Tab Delimited (TSV)   2D SDfile   Computed 3D by Vconf -m prep SDfile
Find this compound or compounds like it in BindingDB:
Activity Spreadsheet -- Enzyme Inhibition Constant Data from BindingDB
Found 1 hit for monomerid = 50228140
TargetPeptidyl-prolyl cis-trans isomerase FKBP1A(Homo sapiens (Human))
University Of California San Diego
Curated by ChEMBL
LigandPNGBDBM50228140(2-(2-isopropylphenoxy)-1-morpholinoethanone | CHEM...)
Affinity DataKd: >2.50E+6nM. Assay description: Binding affinity to human FKBP12 expressed in Escherichia coli BL21(DE3) by isothermal titration calorimetry
In DepthDetails ArticlePubMed