BDBM50229210 CHEMBL438346::N-(4-(trifluoromethylsulfonamido)benzyl)-5-methoxybenzo[b]thiophene-2-carboxamide
SMILES COc1ccc2sc(cc2c1)C(=O)NCc1ccc(NS(=O)(=O)C(F)(F)F)cc1
InChI Key InChIKey=HAKUXQKDYZJDMN-UHFFFAOYSA-N
Data  2 EC50
  Tab Delimited (TSV)   2D SDfile   Computed 3D by Vconf -m prep SDfile
Find this compound or compounds like it in BindingDB:
Activity Spreadsheet -- Enzyme Inhibition Constant Data from BindingDB
Found 2 hits for monomerid = 50229210
TargetPeroxisome proliferator-activated receptor alpha(Homo sapiens (Human))
Glaxosmithkline
Curated by ChEMBL
LigandPNGBDBM50229210(CHEMBL438346 | N-(4-(trifluoromethylsulfonamido)be...)
Affinity DataEC50:  80nM. Assay description: Agonist activity at human PPARalpha assessed as receptor activation by cell based assay
In DepthDetails ArticlePubMed
TargetPeroxisome proliferator-activated receptor alpha(Mus musculus)
Glaxosmithkline
Curated by ChEMBL
LigandPNGBDBM50229210(CHEMBL438346 | N-(4-(trifluoromethylsulfonamido)be...)
Affinity DataEC50:  130nM. Assay description: Agonist activity at mouse PPARalpha assessed as receptor activation by cell based assay
In DepthDetails ArticlePubMed