BDBM50231242 CHEMBL92303
SMILES CCCCCCCCN1CCC(CC1)(C(=O)CC)c1cccc(O)c1
InChI Key InChIKey=DKEUDIJLBJIERV-UHFFFAOYSA-N
Data  1 IC50
  Tab Delimited (TSV)   2D SDfile   Computed 3D by Vconf -m prep SDfile
Find this compound or compounds like it in BindingDB:
Activity Spreadsheet -- Enzyme Inhibition Constant Data from BindingDB
Found 1 hit for monomerid = 50231242
LigandPNGBDBM50231242(CHEMBL92303)
Affinity DataIC50:  2.00E+5nM. Assay description: Tested for displacement of radioligand [3H]-Naloxone from opiate receptor
In DepthDetails ArticlePubMed