BDBM50231721 2-pyridin-2-ylethynyl-7,8-dihydro-6H-quinolin-5-one::CHEMBL253161
SMILES O=C1CCCc2nc(ccc12)C#Cc1ccccn1
InChI Key InChIKey=PEMXOKOYRLFDDT-UHFFFAOYSA-N
Data  1 KI  1 IC50
  Tab Delimited (TSV)   2D SDfile   Computed 3D by Vconf -m prep SDfile
Find this compound or compounds like it in BindingDB:
Activity Spreadsheet -- Enzyme Inhibition Constant Data from BindingDB
Found 2 hits for monomerid = 50231721
TargetMetabotropic glutamate receptor 5(Rattus norvegicus (Rat))
Institute Of Organic Synthesis
Curated by ChEMBL
LigandPNGBDBM50231721(2-pyridin-2-ylethynyl-7,8-dihydro-6H-quinolin-5-on...)
Affinity DataKi:  2.36E+3nM. Assay description: Displacement of [3H]MPEP from rat mGluR5
In DepthDetails ArticlePubMed
TargetMetabotropic glutamate receptor 5(Rattus norvegicus (Rat))
Institute Of Organic Synthesis
Curated by ChEMBL
LigandPNGBDBM50231721(2-pyridin-2-ylethynyl-7,8-dihydro-6H-quinolin-5-on...)
Affinity DataIC50:  6.00E+4nM. Assay description: Displacement of [3H]MPEP from rat mGluR5
In DepthDetails ArticlePubMed