BDBM50231731 2-azepanyl-5-oxo-5,6,7,8-tetrahydroquinoline-3-carbonitrile::CHEMBL401330
SMILES O=C1CCCc2nc(NC3CCCCCC3)c(cc12)C#N
InChI Key InChIKey=DLHPPYSZOSZIKC-UHFFFAOYSA-N
Data  1 IC50
  Tab Delimited (TSV)   2D SDfile   Computed 3D by Vconf -m prep SDfile
Find this compound or compounds like it in BindingDB:
Activity Spreadsheet -- Enzyme Inhibition Constant Data from BindingDB
Found 1 hit for monomerid = 50231731
TargetMetabotropic glutamate receptor 1(RAT)
Institute Of Organic Synthesis
Curated by ChEMBL
LigandPNGBDBM50231731(2-azepanyl-5-oxo-5,6,7,8-tetrahydroquinoline-3-car...)
Affinity DataIC50:  7.40E+3nM. Assay description: Antagonist activity at rat mGluR1 expressed in cerebellar granule cells assessed as accumulation of [3H]inositol phosphate
In DepthDetails ArticlePubMed