BDBM50231747 (R)-2-phenylethynyl-5,6,7,8-tetrahydro-quinolin-5-ol::CHEMBL253159
SMILES O[C@@H]1CCCc2nc(ccc12)C#Cc1ccccc1
InChI Key InChIKey=VUDNTKZUIAXLLZ-QGZVFWFLSA-N
Data  1 KI  2 EC50
  Tab Delimited (TSV)   2D SDfile   Computed 3D by Vconf -m prep SDfile
Find this compound or compounds like it in BindingDB:
Activity Spreadsheet -- Enzyme Inhibition Constant Data from BindingDB
Found 3 hits for monomerid = 50231747
TargetMetabotropic glutamate receptor 5(Rattus norvegicus (Rat))
Institute Of Organic Synthesis
Curated by ChEMBL
LigandPNGBDBM50231747((R)-2-phenylethynyl-5,6,7,8-tetrahydro-quinolin-5-...)
Affinity DataKi:  4.71E+3nM. Assay description: Displacement of [3H]MPEP from rat mGluR5
In DepthDetails ArticlePubMed
TargetMetabotropic glutamate receptor 5(Homo sapiens (Human))
Institute Of Organic Synthesis
Curated by ChEMBL
LigandPNGBDBM50231747((R)-2-phenylethynyl-5,6,7,8-tetrahydro-quinolin-5-...)
Affinity DataEC50:  980nM. Assay description: Antagonist activity at human mGluR5 expressed in CHO cells assessed as L-glutamate induced potensiation of intracellular calcium level by FLIPR assay
In DepthDetails ArticlePubMed
TargetMetabotropic glutamate receptor 5(Rattus norvegicus (Rat))
Institute Of Organic Synthesis
Curated by ChEMBL
LigandPNGBDBM50231747((R)-2-phenylethynyl-5,6,7,8-tetrahydro-quinolin-5-...)
Affinity DataEC50:  180nM. Assay description: Antagonist activity at mGluR5 in Sprague-Dawley rat astrocyte assessed as L-quisqualate induced potensiation of intracellular calcium level by FLIPR ...
In DepthDetails ArticlePubMed