BDBM50231748 CHEMBL253347::quinoline-3-carboxylic acid adamantan-1-ylamide
SMILES O=C(NC12CC3CC(CC(C3)C1)C2)c1cnc2ccccc2c1
InChI Key InChIKey=FVQAOJSJLLDAKM-UHFFFAOYSA-N
Data  1 IC50
  Tab Delimited (TSV)   2D SDfile   Computed 3D by Vconf -m prep SDfile
Find this compound or compounds like it in BindingDB:
Activity Spreadsheet -- Enzyme Inhibition Constant Data from BindingDB
Found 1 hit for monomerid = 50231748
TargetMetabotropic glutamate receptor 1(RAT)
Institute Of Organic Synthesis
Curated by ChEMBL
LigandPNGBDBM50231748(CHEMBL253347 | quinoline-3-carboxylic acid adamant...)
Affinity DataIC50:  52nM. Assay description: Antagonist activity at rat mGluR1 expressed in cerebellar granule cells assessed as accumulation of [3H]inositol phosphate
In DepthDetails ArticlePubMed