BDBM50231750 (3-ethyl-2-methylquinolin-6-yl)(4-methoxycyclohexyl)methanone::CHEMBL253345
SMILES CCc1cc2cc(ccc2nc1C)C(=O)C1CCC(CC1)OC
InChI Key InChIKey=VEURHZYLLRSEGL-UHFFFAOYSA-N
Data  1 IC50
  Tab Delimited (TSV)   2D SDfile   Computed 3D by Vconf -m prep SDfile
Find this compound or compounds like it in BindingDB:
Activity Spreadsheet -- Enzyme Inhibition Constant Data from BindingDB
Found 1 hit for monomerid = 50231750
TargetMetabotropic glutamate receptor 1(RAT)
Institute Of Organic Synthesis
Curated by ChEMBL
LigandPNGBDBM50231750((3-ethyl-2-methylquinolin-6-yl)(4-methoxycyclohexy...)
Affinity DataIC50:  3nM. Assay description: Antagonist activity at rat mGluR1 expressed in cerebellar granule cells assessed as accumulation of [3H]inositol phosphate
In DepthDetails ArticlePubMed