BDBM50232626 CHEMBL4070965
SMILES Fc1cc(OCC[C@@H]2C[C@@H]2C2CCN(CC2)c2ncc(Cl)cn2)ccc1CC(=O)N1CCCCC1
InChI Key InChIKey=NTDKBSAIEZAUKX-HYBUGGRVSA-N
Data  1 IC50  2 EC50
  Tab Delimited (TSV)   2D SDfile   Computed 3D by Vconf -m prep SDfile
Find this compound or compounds like it in BindingDB:
Activity Spreadsheet -- Enzyme Inhibition Constant Data from BindingDB
Found 3 hits for monomerid = 50232626
TargetPotassium voltage-gated channel subfamily H member 2(Homo sapiens (Human))
Merck
Curated by ChEMBL
LigandPNGBDBM50232626(CHEMBL4070965)
Affinity DataIC50:  3.30E+3nM. Assay description: Inhibition of human ERG
In DepthDetails ArticlePubMed
TargetGlucose-dependent insulinotropic receptor(Mus musculus)
Merck
Curated by ChEMBL
LigandPNGBDBM50232626(CHEMBL4070965)
Affinity DataEC50:  2.20nM. Assay description: Agonist activity at mouse GPR119 expressed in CHO cells co-expressing Galpha15 assessed as increase in intracellular cAMP level after 60 mins by HTRF...
In DepthDetails ArticlePubMed
TargetGlucose-dependent insulinotropic receptor(Homo sapiens (Human))
Merck
Curated by ChEMBL
LigandPNGBDBM50232626(CHEMBL4070965)
Affinity DataEC50:  1.5nM. Assay description: Agonist activity at human GPR119 expressed in HEK293 cells assessed as increase in intracellular cAMP level after 60 mins by HTRF assay
In DepthDetails ArticlePubMed