BDBM50232632 CHEMBL4083676
SMILES Clc1cnc(nc1)N1CCC(CC1)[C@H]1C[C@H]1CCOc1ccc(CC(=O)NC2CC2)cc1
InChI Key InChIKey=TXTDBHGRQKDAGP-AUSIDOKSSA-N
Data  1 IC50  2 EC50
  Tab Delimited (TSV)   2D SDfile   Computed 3D by Vconf -m prep SDfile
Find this compound or compounds like it in BindingDB:
Activity Spreadsheet -- Enzyme Inhibition Constant Data from BindingDB
Found 3 hits for monomerid = 50232632
TargetGlucose-dependent insulinotropic receptor(Homo sapiens (Human))
Merck
Curated by ChEMBL
LigandPNGBDBM50232632(CHEMBL4083676)
Affinity DataEC50:  1.80nM. Assay description: Agonist activity at human GPR119 expressed in HEK293 cells assessed as increase in intracellular cAMP level after 60 mins by HTRF assay
In DepthDetails ArticlePubMed
TargetGlucose-dependent insulinotropic receptor(Mus musculus)
Merck
Curated by ChEMBL
LigandPNGBDBM50232632(CHEMBL4083676)
Affinity DataEC50:  1.5nM. Assay description: Agonist activity at mouse GPR119 expressed in CHO cells co-expressing Galpha15 assessed as increase in intracellular cAMP level after 60 mins by HTRF...
In DepthDetails ArticlePubMed
TargetPotassium voltage-gated channel subfamily H member 2(Homo sapiens (Human))
Merck
Curated by ChEMBL
LigandPNGBDBM50232632(CHEMBL4083676)
Affinity DataIC50: >6.00E+4nM. Assay description: Inhibition of human ERG
In DepthDetails ArticlePubMed