BDBM50232884 CHEMBL4060962
SMILES [H][C@]12C[C@@]3([H])C4=CCO[C@@]5([H])CC(=O)N6c7ccc(N)cc7[C@@]1(CCN2C4)[C@]6([H])[C@@]35[H]
InChI Key InChIKey=NRGHCWQGTHPFTE-FVWCLLPLSA-N
Data  1 KI  6 IC50
  Tab Delimited (TSV)   2D SDfile   Computed 3D by Vconf -m prep SDfile
Find this compound or compounds like it in BindingDB:
Activity Spreadsheet -- Enzyme Inhibition Constant Data from BindingDB
Found 7 hits for monomerid = 50232884
TargetGlycine receptor subunit alpha-1(RAT)
The German University In Cairo
Curated by ChEMBL
LigandPNGBDBM50232884(CHEMBL4060962)
Affinity DataKi:  18nM. Assay description: Displacement of [3H]strychnine from glycine receptor alpha 1 in rat brain synaptic membranes
In DepthDetails ArticlePubMed
TargetGlycine receptor subunit alpha-1(Homo sapiens (Human))
The German University In Cairo
Curated by ChEMBL
LigandPNGBDBM50232884(CHEMBL4060962)
Affinity DataIC50:  77nM. Assay description: Antagonist activity at recombinant human glycine receptor alpha 1 expressed in human tsA201 cells assessed as inhibition of glycine-induced receptor ...
In DepthDetails ArticlePubMed
TargetGlycine receptor subunit alpha-1/beta(Homo sapiens (Human))
The German University In Cairo
Curated by ChEMBL
LigandPNGBDBM50232884(CHEMBL4060962)
Affinity DataIC50:  270nM. Assay description: Antagonist activity at recombinant human glycine receptor alpha 1 beta expressed in human tsA201 cells assessed as inhibition of glycine-induced rece...
In DepthDetails ArticlePubMed
TargetGlycine receptor subunit alpha-1/beta(Homo sapiens (Human))
The German University In Cairo
Curated by ChEMBL
LigandPNGBDBM50232884(CHEMBL4060962)
Affinity DataIC50:  97nM. Assay description: Antagonist activity at recombinant human glycine receptor alpha 1 beta expressed in HEK293 cells assessed as inhibition of glycine-induced current at...
In DepthDetails ArticlePubMed
TargetGlycine receptor subunit alpha-1/beta(Homo sapiens (Human))
The German University In Cairo
Curated by ChEMBL
LigandPNGBDBM50232884(CHEMBL4060962)
Affinity DataIC50:  275nM. Assay description: Antagonist activity at recombinant human glycine receptor alpha 1 beta expressed in human tsA201 cells assessed as inhibition of glycine-induced rece...
In DepthDetails ArticlePubMed
TargetGlycine receptor subunit alpha-1(Homo sapiens (Human))
The German University In Cairo
Curated by ChEMBL
LigandPNGBDBM50232884(CHEMBL4060962)
Affinity DataIC50:  76nM. Assay description: Antagonist activity at recombinant human glycine receptor alpha 1 expressed in HEK293 cells assessed as inhibition of glycine-induced current at -50 ...
In DepthDetails ArticlePubMed
TargetGlycine receptor subunit alpha-1(Homo sapiens (Human))
The German University In Cairo
Curated by ChEMBL
LigandPNGBDBM50232884(CHEMBL4060962)
Affinity DataIC50:  78nM. Assay description: Antagonist activity at recombinant human glycine receptor alpha 1 expressed in human tsA201 cells assessed as inhibition of glycine-induced receptor ...
In DepthDetails ArticlePubMed