BDBM50233010 CHEMBL252253::N-((1R,13bS)-6-chloro-1,3,4,13b-tetrahydro-2H-9-oxa-4a-aza-tribenzo[a,c,e]cyclohepten-1-yl)-2,2,2-trifluoro-acetamide
SMILES FC(F)(F)C(=O)N[C@@H]1CCCN2[C@H]1c1ccccc1Oc1ccc(Cl)cc21
InChI Key InChIKey=JNJFNFCZHXIGJI-DYVFJYSZSA-N
Data  1 EC50
  Tab Delimited (TSV)   2D SDfile   Computed 3D by Vconf -m prep SDfile
Find this compound or compounds like it in BindingDB:
Activity Spreadsheet -- Enzyme Inhibition Constant Data from BindingDB
Found 1 hit for monomerid = 50233010
TargetProgesterone receptor(Homo sapiens (Human))
Nv Organon
Curated by ChEMBL
LigandPNGBDBM50233010(CHEMBL252253 | N-((1R,13bS)-6-chloro-1,3,4,13b-tet...)
Affinity DataEC50:  54nM. Assay description: Agonist activity at progesterone receptor expressed in CHO cells by luciferase assay
In DepthDetails ArticlePubMed