BDBM50234376 CHEMBL252996::dimethyl 2-(4-(2-(6-((hydroxyimino)(phenyl)methyl)-4,4-dimethyl-3,4-dihydroquinolin-1(2H)-yl)ethoxy)benzyl)malonate
SMILES COC(=O)C(Cc1ccc(OCCN2CCC(C)(C)c3cc(ccc23)C(N=O)c2ccccc2)cc1)C(=O)OC
InChI Key InChIKey=FNORSYDEHFXZIT-UHFFFAOYSA-N
Data  1 KI  1 EC50
  Tab Delimited (TSV)   2D SDfile   Computed 3D by Vconf -m prep SDfile
Find this compound or compounds like it in BindingDB:
Activity Spreadsheet -- Enzyme Inhibition Constant Data from BindingDB
Found 2 hits for monomerid = 50234376
TargetPeroxisome proliferator-activated receptor gamma(Homo sapiens (Human))
Spot-Ea3857
Curated by ChEMBL
LigandPNGBDBM50234376(CHEMBL252996 | dimethyl 2-(4-(2-(6-((hydroxyimino)...)
Affinity DataKi:  1.00E+4nM. Assay description: Displacement of [3H]Rosiglitazone from human PPARgamma
In DepthDetails ArticlePubMed
TargetPeroxisome proliferator-activated receptor alpha(Homo sapiens (Human))
Spot-Ea3857
Curated by ChEMBL
LigandPNGBDBM50234376(CHEMBL252996 | dimethyl 2-(4-(2-(6-((hydroxyimino)...)
Affinity DataEC50:  195nM. Assay description: Agonist activity at human PPARalpha at 100 uM by GAL4 transactivation assay relative to WY 14,643
In DepthDetails ArticlePubMed