BDBM50235098 2-(4-(2-(4-(quinolin-2-ylmethoxy)phenyl)bicyclo[2.2.1]heptan-2-yl)phenoxy)acetic acid::CHEMBL401668
SMILES OC(=O)COc1ccc(cc1)C1(CC2CCC1C2)c1ccc(OCc2ccc3ccccc3n2)cc1
InChI Key InChIKey=KXWOKFUMDJXHMW-UHFFFAOYSA-N
Data  2 IC50
  Tab Delimited (TSV)   2D SDfile   Computed 3D by Vconf -m prep SDfile
Find this compound or compounds like it in BindingDB:
Activity Spreadsheet -- Enzyme Inhibition Constant Data from BindingDB
Found 2 hits for monomerid = 50235098
TargetArachidonate 5-lipoxygenase-activating protein(Homo sapiens (Human))
Merck Frosst Centre For Therapeutic Research
Curated by ChEMBL
LigandPNGBDBM50235098(2-(4-(2-(4-(quinolin-2-ylmethoxy)phenyl)bicyclo[2....)
Affinity DataIC50:  98nM. Assay description: Displacement of [125I]L-691831 from FLAP
In DepthDetails ArticlePubMed
TargetPolyunsaturated fatty acid 5-lipoxygenase(Homo sapiens (Human))
Merck Frosst Centre For Therapeutic Research
Curated by ChEMBL
LigandPNGBDBM50235098(2-(4-(2-(4-(quinolin-2-ylmethoxy)phenyl)bicyclo[2....)
Affinity DataIC50: >6.30E+3nM. Assay description: Inhibition of 5LOX
In DepthDetails ArticlePubMed