BDBM50235300 CHEMBL4087730
SMILES Clc1ccccc1-n1ccc2ccc(NC(=O)NCC(=O)NCCCCN[C@@H]3CCCN(C3)c3ncnc4[nH]ccc34)cc12
InChI Key InChIKey=IVRUVQIFMAFFKV-XMMPIXPASA-N
Data  2 IC50
  Tab Delimited (TSV)   2D SDfile   Computed 3D by Vconf -m prep SDfile
Find this compound or compounds like it in BindingDB:
Activity Spreadsheet -- Enzyme Inhibition Constant Data from BindingDB
Found 2 hits for monomerid = 50235300
TargetHistone-lysine N-methyltransferase, H3 lysine-79 specific(Homo sapiens (Human))
Novartis Institutes For Biomedical Research
Curated by ChEMBL
LigandPNGBDBM50235300(CHEMBL4087730)
Affinity DataIC50:  4nM. Assay description: Inhibition of DOT1L (2 to 416 residues) (unknown origin) using biotinylated nucleosomes as substrate preincubated for 30 mins followed by substrate a...
In DepthDetails ArticlePubMed
TargetHistone-lysine N-methyltransferase, H3 lysine-79 specific(Homo sapiens (Human))
Novartis Institutes For Biomedical Research
Curated by ChEMBL
LigandPNGBDBM50235300(CHEMBL4087730)
Affinity DataIC50:  4nM. Assay description: Inhibition of DOT1L (2 to 416 residues) (unknown origin) using biotinylated nucleosomes as substrate preincubated for 30 mins followed by substrate a...
In DepthDetails ArticlePubMed