BDBM50235744 CHEMBL4071613
SMILES CC(C)c1ccc2[nH]c(cc2c1)C(O)=O
InChI Key InChIKey=FUOMWKBVELXWCU-UHFFFAOYSA-N
Data  1 IC50
  Tab Delimited (TSV)   2D SDfile   Computed 3D by Vconf -m prep SDfile
Find this compound or compounds like it in BindingDB:
Activity Spreadsheet -- Enzyme Inhibition Constant Data from BindingDB
Found 1 hit for monomerid = 50235744
TargetEukaryotic initiation factor 4A-III(Homo sapiens (Human))
Takeda Pharmaceutical
Curated by ChEMBL
LigandPNGBDBM50235744(CHEMBL4071613)
Affinity DataIC50: >1.00E+5nM. Assay description: Inhibition of MLN51-induced full length recombinant human N-terminal His6/SUMO-tagged eIF4A3 RNA dependent ATPase activity expressed in Escherichia c...
In DepthDetails ArticlePubMed