BDBM50239588 CHEMBL4077905
SMILES CCn1c2NC3=C(C(c4ccc(Cl)cc4)c2c(=O)[nH]c1=O)C(=O)OC3
InChI Key InChIKey=SLWPFZUDYLJXOB-UHFFFAOYSA-N
Data  2 KI
  Tab Delimited (TSV)   2D SDfile   Computed 3D by Vconf -m prep SDfile
Find this compound or compounds like it in BindingDB:
Activity Spreadsheet -- Enzyme Inhibition Constant Data from BindingDB
Found 2 hits for monomerid = 50239588
TargetBromodomain-containing protein 4(Homo sapiens (Human))
University of Minnesota
Curated by ChEMBL
LigandPNGBDBM50239588(CHEMBL4077905)
Affinity DataKi:  300nM. Assay description: Inhibition of BI-BODIPY binding to BRD4 bromodomain 1 (42 to 168 residues)(unknown origin) expressed in Escherichia coli BL21(DE3) by fluorescence an...
In DepthDetails ArticlePubMed
TargetBromodomain testis-specific protein(Homo sapiens (Human))
University of Minnesota
Curated by ChEMBL
LigandPNGBDBM50239588(CHEMBL4077905)
Affinity DataKi:  1.10E+3nM. Assay description: Inhibition of BI-BODIPY binding to BRDT bromodomain 1 (29 to 134 residues) (unknown origin) expressed in Escherichia coli BL21(DE3) by fluorescence a...
In DepthDetails ArticlePubMed