BDBM50239641 CHEMBL4085568
SMILES CC(C)C1(c2c(C)[nH]nc2OC(N)=C1C#N)c1cc(cc(c1)-c1cccc2ccsc12)C#N
InChI Key InChIKey=QCPWCZKASIKFDA-UHFFFAOYSA-N
Data  1 IC50
  Tab Delimited (TSV)   2D SDfile   Computed 3D by Vconf -m prep SDfile
Find this compound or compounds like it in BindingDB:
Activity Spreadsheet -- Enzyme Inhibition Constant Data from BindingDB
Found 1 hit for monomerid = 50239641
TargetGlycine hydroxymethyltransferase(Plasmodium falciparum)
Eth Zurich
Curated by ChEMBL
LigandPNGBDBM50239641(CHEMBL4085568)
Affinity DataIC50:  60nM. Assay description: Inhibition of Plasmodium falciparum SHMT using L-serine/(6S)-THF as substrate by methylene tetrahydrofolate dehydrogenase coupled enzyme assay
In DepthDetails ArticlePubMed