BDBM50239664 CHEMBL4088892
SMILES CC(C)[C@]1(c2c(C)[nH]nc2OC(N)=C1C#N)c1cc(F)cc(c1)N1CCC(CC(O)=O)CC1
InChI Key InChIKey=LNTOYLXMWSSXMA-DEOSSOPVSA-N
Data  1 IC50
PDB links: 1 PDB ID matches this monomer.
  Tab Delimited (TSV)   2D SDfile   Computed 3D by Vconf -m prep SDfile
Find this compound or compounds like it in BindingDB:
Activity Spreadsheet -- Enzyme Inhibition Constant Data from BindingDB
Found 1 hit for monomerid = 50239664
TargetGlycine hydroxymethyltransferase(Plasmodium falciparum)
Eth Zurich
Curated by ChEMBL
LigandPNGBDBM50239664(CHEMBL4088892)
Affinity DataIC50:  110nM. Assay description: Inhibition of Plasmodium falciparum SHMT using L-serine/(6S)-THF as substrate by methylene tetrahydrofolate dehydrogenase coupled enzyme assay
In DepthDetails ArticlePubMed