BDBM50239670 CHEMBL4062141
SMILES CC(C)C1(c2c(C)[nH]nc2OC(N)=C1C#N)c1cc(CC(F)(F)F)cc(c1)-c1ccc(Cl)s1
InChI Key InChIKey=ZRVITFSKHPEOLV-UHFFFAOYSA-N
Data  1 IC50
  Tab Delimited (TSV)   2D SDfile   Computed 3D by Vconf -m prep SDfile
Find this compound or compounds like it in BindingDB:
Activity Spreadsheet -- Enzyme Inhibition Constant Data from BindingDB
Found 1 hit for monomerid = 50239670
TargetGlycine hydroxymethyltransferase(Plasmodium falciparum)
Eth Zurich
Curated by ChEMBL
LigandPNGBDBM50239670(CHEMBL4062141)
Affinity DataIC50:  7.11E+3nM. Assay description: Inhibition of Plasmodium falciparum SHMT using L-serine/(6S)-THF as substrate by methylene tetrahydrofolate dehydrogenase coupled enzyme assay
In DepthDetails ArticlePubMed