BDBM50239676 CHEMBL4078219
SMILES CC(C)C1(c2c(C)[nH]nc2OC(N)=C1C#N)c1cc(F)cc(c1)-c1cccc(CCC(O)=O)c1
InChI Key InChIKey=MGFALDRJNSGSKD-UHFFFAOYSA-N
Data  1 IC50
PDB links: 1 PDB ID matches this monomer.
  Tab Delimited (TSV)   2D SDfile   Computed 3D by Vconf -m prep SDfile
Find this compound or compounds like it in BindingDB:
Activity Spreadsheet -- Enzyme Inhibition Constant Data from BindingDB
Found 1 hit for monomerid = 50239676
TargetGlycine hydroxymethyltransferase(Plasmodium falciparum)
Eth Zurich
Curated by ChEMBL
LigandPNGBDBM50239676(CHEMBL4078219)
Affinity DataIC50:  90nM. Assay description: Inhibition of Plasmodium falciparum SHMT using L-serine/(6S)-THF as substrate by methylene tetrahydrofolate dehydrogenase coupled enzyme assay
In DepthDetails ArticlePubMed