BDBM50240466 CHEMBL4060490
SMILES CCN(CC(=O)NO)S(=O)(=O)c1ccc(OC)cc1
InChI Key InChIKey=BMGIQUIFFLZGIA-UHFFFAOYSA-N
Data  1 IC50
  Tab Delimited (TSV)   2D SDfile   Computed 3D by Vconf -m prep SDfile
Find this compound or compounds like it in BindingDB:
Activity Spreadsheet -- Enzyme Inhibition Constant Data from BindingDB
Found 1 hit for monomerid = 50240466
TargetMeprin A subunit beta(Homo sapiens)
Fraunhofer Institute For Cell Therapy and Immunology Izi
Curated by ChEMBL
LigandPNGBDBM50240466(CHEMBL4060490)
Affinity DataIC50:  3.12E+4nM. Assay description: Inhibition of recombinant human meprin beta expressed in yeast using Abz-YVAEAPK(Dnp)G-OH as substrate by fluorescence assay
In DepthDetails ArticlePubMed