BDBM50241639 CHEMBL4081944
SMILES OC[C@H]1O[C@H]([C@H](O)[C@@H](O)[C@@H]1O)n1cc(F)c(=O)[nH]c1=O
InChI Key InChIKey=YHWGRVDTEORPPJ-XSEHCYKFSA-N
Data  1 KI
PDB links: 1 PDB ID matches this monomer.
  Tab Delimited (TSV)   2D SDfile   Computed 3D by Vconf -m prep SDfile
Find this compound or compounds like it in BindingDB:
Activity Spreadsheet -- Enzyme Inhibition Constant Data from BindingDB
Found 1 hit for monomerid = 50241639
TargetGlycogen phosphorylase, muscle form(Oryctolagus cuniculus (rabbit))
University Of Debrecen
Curated by ChEMBL
LigandPNGBDBM50241639(CHEMBL4081944)
Affinity DataKi:  5.50E+3nM. Assay description: Competitive inhibition of rabbit muscle glycogen phosphorylase b using glucose-1-phosphate as substrate in presence of constant concentrations of gly...