BDBM50241694 3-methoxy-4-hydroxylonchocarpin::CHEMBL463206
SMILES COc1cc(\C=C\C(=O)c2ccc3OC(C)(C)C=Cc3c2O)ccc1O
InChI Key InChIKey=WNUBZQVPFKTBOZ-QPJJXVBHSA-N
Data  1 IC50
  Tab Delimited (TSV)   2D SDfile   Computed 3D by Vconf -m prep SDfile
Find this compound or compounds like it in BindingDB:
Activity Spreadsheet -- Enzyme Inhibition Constant Data from BindingDB
Found 1 hit for monomerid = 50241694
TargetOrnithine decarboxylase(Homo sapiens (Human))
University Of California
Curated by ChEMBL
LigandPNGBDBM50241694(3-methoxy-4-hydroxylonchocarpin | CHEMBL463206)
Affinity DataIC50:  3.60E+3nM. Assay description: Inhibition of phorbol ester-induced ornithine decraboxylase in human MCF7 cells after 6 hrs
In DepthDetails ArticlePubMed