BDBM50241849 CHEMBL4070999
SMILES CC(C)C(C\C=C1\CC(CO)(COC(=O)c2cn(C)c3ccccc23)OC1=O)C(C)C
InChI Key InChIKey=JSXUDEUMWQFINT-ZDLGFXPLSA-N
Data  3 KI
  Tab Delimited (TSV)   2D SDfile   Computed 3D by Vconf -m prep SDfile
Find this compound or compounds like it in BindingDB:
Activity Spreadsheet -- Enzyme Inhibition Constant Data from BindingDB
Found 3 hits for monomerid = 50241849
TargetRAS guanyl-releasing protein 1(Homo sapiens (Human))
National Institute Of Industrial Technology
Curated by ChEMBL
LigandPNGBDBM50241849(CHEMBL4070999)
Affinity DataKi:  23nM. Assay description: Displacement of [20-3H]phorbol 12,13-dibutyrate from RasGRP1 (unknown origin) in the presence of porcine brain phosphatidylserine by scintillation co...
In DepthDetails ArticlePubMed
TargetProtein kinase C epsilon type(Homo sapiens (Human))
National Institute Of Industrial Technology
Curated by ChEMBL
LigandPNGBDBM50241849(CHEMBL4070999)
Affinity DataKi:  55nM. Assay description: Displacement of [20-3H]phorbol 12,13-dibutyrate from PKCepsilon (unknown origin) in the presence of porcine brain phosphatidylserine by scintillation...
In DepthDetails ArticlePubMed
TargetProtein kinase C alpha type(Homo sapiens (Human))
National Institute Of Industrial Technology
Curated by ChEMBL
LigandPNGBDBM50241849(CHEMBL4070999)
Affinity DataKi:  83nM. Assay description: Displacement of [20-3H]phorbol 12,13-dibutyrate from PKCalpha (unknown origin) in the presence of porcine brain phosphatidylserine by scintillation c...
In DepthDetails ArticlePubMed