BDBM50241856 CHEMBL4097154
SMILES Cc1ccc(cc1)C#Cc1ccc(C=C2CC(CO)(COC(=O)c3cn(C)c4ccccc34)OC2=O)cc1
InChI Key InChIKey=OBNHABKOCPUFDD-UHFFFAOYSA-N
Data  3 KI
  Tab Delimited (TSV)   2D SDfile   Computed 3D by Vconf -m prep SDfile
Find this compound or compounds like it in BindingDB:
Activity Spreadsheet -- Enzyme Inhibition Constant Data from BindingDB
Found 3 hits for monomerid = 50241856
TargetRAS guanyl-releasing protein 1(Homo sapiens (Human))
National Institute Of Industrial Technology
Curated by ChEMBL
LigandPNGBDBM50241856(CHEMBL4097154)
Affinity DataKi:  23nM. Assay description: Displacement of [20-3H]phorbol 12,13-dibutyrate from RasGRP1 (unknown origin) in the presence of porcine brain phosphatidylserine by scintillation co...
In DepthDetails ArticlePubMed
TargetProtein kinase C alpha type(Homo sapiens (Human))
National Institute Of Industrial Technology
Curated by ChEMBL
LigandPNGBDBM50241856(CHEMBL4097154)
Affinity DataKi:  116nM. Assay description: Displacement of [20-3H]phorbol 12,13-dibutyrate from PKCalpha (unknown origin) in the presence of porcine brain phosphatidylserine by scintillation c...
In DepthDetails ArticlePubMed
TargetProtein kinase C epsilon type(Homo sapiens (Human))
National Institute Of Industrial Technology
Curated by ChEMBL
LigandPNGBDBM50241856(CHEMBL4097154)
Affinity DataKi:  131nM. Assay description: Displacement of [20-3H]phorbol 12,13-dibutyrate from PKCepsilon (unknown origin) in the presence of porcine brain phosphatidylserine by scintillation...
In DepthDetails ArticlePubMed