BDBM50241976 CHEMBL4088053
SMILES [H][C@]1(CC[C@@H](O1)C(C)(C)O)[C@@H](C)[C@@]1([H])CC[C@@]2([H])\C(CCC[C@]12C)=C\C=C1\C[C@@H](O)C[C@@H](O)C1=C
InChI Key InChIKey=DDIWZQGTNVZJGO-WKBHYAOGSA-N
Data  1 EC50
  Tab Delimited (TSV)   2D SDfile   Computed 3D by Vconf -m prep SDfile
Find this compound or compounds like it in BindingDB:
Activity Spreadsheet -- Enzyme Inhibition Constant Data from BindingDB
Found 1 hit for monomerid = 50241976
TargetVitamin D3 receptor A(Danio rerio)
Institute Of Genetics And Molecular And Cellular Biology (Igbmc)
Curated by ChEMBL
LigandPNGBDBM50241976(CHEMBL4088053)
Affinity DataEC50: >100nM. Assay description: Agonist activity at zebrafish VDR LBD (156 to 453 residues) expressed in HEK293 EBNA cells harboring human CYP24-Tk-Luc plasmid assessed as induction...
In DepthDetails ArticlePubMed