BDBM50242210 CHEMBL4104823
SMILES C[C@H](NC(=O)[C@@H](Cc1c[nH]c2ccccc12)NC(=O)[C@@H](N)Cc1cnc[nH]1)C(=O)NN(Cc1c(C)cccc1C)C(=O)N[C@H](Cc1ccccc1)C(=O)N[C@@H](CCCCN)C(N)=O
InChI Key InChIKey=JVJIOHIQRYSRFH-KOMBBWEZSA-N
Data  1 IC50
  Tab Delimited (TSV)   2D SDfile   Computed 3D by Vconf -m prep SDfile
Find this compound or compounds like it in BindingDB:
Activity Spreadsheet -- Enzyme Inhibition Constant Data from BindingDB
Found 1 hit for monomerid = 50242210
TargetPlatelet glycoprotein 4(Rattus norvegicus)
Universit£
Curated by ChEMBL
LigandPNGBDBM50242210(CHEMBL4104823)
Affinity DataIC50:  5.51E+3nM. Assay description: Inhibition of photoactivatable [125I]-Tyr-Bpa-Ala-hexarelin binding to CD36 in Sprague-Dawley rat heart membranes after 60 mins by SDS-PAGE analysis
In DepthDetails ArticlePubMed