BDBM50243790 3-(benzo[d][1,3]dioxol-5-yl)cyclohex-2-enone::CHEMBL443666
SMILES O=C1CCCC(=C1)c1ccc2OCOc2c1
InChI Key InChIKey=MXLZCNRUWFQQCV-UHFFFAOYSA-N
Data  1 IC50
  Tab Delimited (TSV)   2D SDfile   Computed 3D by Vconf -m prep SDfile
Find this compound or compounds like it in BindingDB:
Activity Spreadsheet -- Enzyme Inhibition Constant Data from BindingDB
Found 1 hit for monomerid = 50243790
TargetCalmodulin-sensitive adenylate cyclase(Bacillus anthracis)
The University Of Texas Medical Branch
Curated by ChEMBL
LigandPNGBDBM50243790(3-(benzo[d][1,3]dioxol-5-yl)cyclohex-2-enone | CHE...)
Affinity DataIC50:  5.30E+4nM. Assay description: Inhibition of Bacilus anthracis edema factor-induced edema in RAW264.7 mouse macrophages by cAMP-specific ELISA
In DepthDetails ArticlePubMed