BDBM50243846 3,5-Dichloro-N-[1-(3,3-dimethyl-butyl)-piperidin-4-ylmethyl]-benzamide::3,5-dichloro-N-((1-(3,3-dimethylbutyl)piperidin-4-yl)methyl)benzamide::CHEMBL488468
SMILES CC(C)(C)CCN1CCC(CNC(=O)c2cc(Cl)cc(Cl)c2)CC1
InChI Key InChIKey=OVPYRUXSNJNEFM-UHFFFAOYSA-N
Data  3 IC50
  Tab Delimited (TSV)   2D SDfile   Computed 3D by Vconf -m prep SDfile
Find this compound or compounds like it in BindingDB:
Activity Spreadsheet -- Enzyme Inhibition Constant Data from BindingDB
Found 3 hits for monomerid = 50243846
TargetPotassium voltage-gated channel subfamily H member 2(Homo sapiens (Human))
Merck Research Laboratories
Curated by ChEMBL
LigandPNGBDBM50243846(3,5-Dichloro-N-[1-(3,3-dimethyl-butyl)-piperidin-4...)
Affinity DataIC50:  1.93E+3nM. Assay description: Antagonist activity at human ERG by voltage-clamp electrophysiology assay
In DepthDetails ArticlePubMed
TargetPotassium voltage-gated channel subfamily H member 2(Homo sapiens (Human))
Merck Research Laboratories
Curated by ChEMBL
LigandPNGBDBM50243846(3,5-Dichloro-N-[1-(3,3-dimethyl-butyl)-piperidin-4...)
Affinity DataIC50:  1.93E+3nM. Assay description: Inhibition of human ERG
In DepthDetails ArticlePubMed
TargetVoltage-dependent T-type calcium channel subunit alpha-1I(Homo sapiens (Human))
Merck Research Laboratories
Curated by ChEMBL
LigandPNGBDBM50243846(3,5-Dichloro-N-[1-(3,3-dimethyl-butyl)-piperidin-4...)
Affinity DataIC50:  61nM. Assay description: Inhibition of T-type calcium channel alpha1I (unknown origin) by FLIPR
In DepthDetails ArticlePubMed