BDBM50244155 1-(4-chlorobenzoyl)-3-(methylthio)-hexahydrobenzo[c]thiophen-4(1H)-one::CHEMBL511684
SMILES CSC1SC(C2CCCC(=O)C12)C(=O)c1ccc(Cl)cc1
InChI Key InChIKey=MWAUZLNCUAEKNR-UHFFFAOYSA-N
Data  2 IC50
  Tab Delimited (TSV)   2D SDfile   Computed 3D by Vconf -m prep SDfile
Find this compound or compounds like it in BindingDB:
Activity Spreadsheet -- Enzyme Inhibition Constant Data from BindingDB
Found 2 hits for monomerid = 50244155
TargetGamma-aminobutyric acid receptor subunit alpha-5(Homo sapiens (Human))
Moltech
Curated by ChEMBL
LigandPNGBDBM50244155(1-(4-chlorobenzoyl)-3-(methylthio)-hexahydrobenzo[...)
Affinity DataIC50:  550nM. Assay description: Displacement of [3H]Ro15-4513 from GABAA alpha-5-beta-2-gamma-2 receptor expressed in Sf9 baculovirus system
In DepthDetails ArticlePubMed
TargetGamma-aminobutyric acid receptor subunit alpha-1(Homo sapiens (Human))
Moltech
Curated by ChEMBL
LigandPNGBDBM50244155(1-(4-chlorobenzoyl)-3-(methylthio)-hexahydrobenzo[...)
Affinity DataIC50:  580nM. Assay description: Displacement of [3H]Ro15-4513 from GABAA alpha-1-beta-2-gamma-2 receptor expressed in Sf9 baculovirus system
In DepthDetails ArticlePubMed