BDBM50245378 4-chloro-N-(6-(6,7-dimethoxyquinolin-4-yloxy)-1-methyl-1H-indazol-3-yl)picolinamide::CHEMBL462175
SMILES COc1cc2nccc(Oc3ccc4c(NC(=O)c5cc(Cl)ccn5)nn(C)c4c3)c2cc1OC
InChI Key InChIKey=PGVQGRXAKLFXDO-UHFFFAOYSA-N
Data  1 IC50
  Tab Delimited (TSV)   2D SDfile   Computed 3D by Vconf -m prep SDfile
Find this compound or compounds like it in BindingDB:
Activity Spreadsheet -- Enzyme Inhibition Constant Data from BindingDB
Found 1 hit for monomerid = 50245378
TargetVascular endothelial growth factor receptor 2(Homo sapiens (Human))
Amgen
Curated by ChEMBL
LigandPNGBDBM50245378(4-chloro-N-(6-(6,7-dimethoxyquinolin-4-yloxy)-1-me...)
Affinity DataIC50:  2nM. Assay description: Inhibition of recombinant KDR by HTRF assay
In DepthDetails ArticlePubMed