BDBM50247595 CHEMBL4064397
SMILES Cc1cc(NC2CCN(CC2)C(=O)CCNCC(O)=O)nc(NCc2cn(CCCNCCCNC3CCCCC3)nn2)n1
InChI Key InChIKey=AIETUBHCUYNJHA-UHFFFAOYSA-N
Data  7 IC50  1 EC50
  Tab Delimited (TSV)   2D SDfile   Computed 3D by Vconf -m prep SDfile
Find this compound or compounds like it in BindingDB:
Activity Spreadsheet -- Enzyme Inhibition Constant Data from BindingDB
Found 8 hits for monomerid = 50247595
TargetC-X-C chemokine receptor type 4(Homo sapiens (Human))
National Health Research Institutes
Curated by ChEMBL
LigandPNGBDBM50247595(CHEMBL4064397)
Affinity DataIC50:  34nM. Assay description: Displacement of [125I]CXCL12 from human CXCR4 expressed in HEK293 cell membranes after 1.5 hrs by Topcount method
Ligand InfoPC cidPC sid
In DepthDetails ArticlePubMed
TargetCytochrome P450 3A4(Homo sapiens (Human))
National Health Research Institutes
Curated by ChEMBL
LigandPNGBDBM50247595(CHEMBL4064397)
Affinity DataIC50: >1.00E+5nM. Assay description: Inhibition of human liver microsomal CYP3A4
Ligand InfoPC cidPC sid
In DepthDetails ArticlePubMed
TargetCytochrome P450 2E1(Homo sapiens (Human))
National Health Research Institutes
Curated by ChEMBL
LigandPNGBDBM50247595(CHEMBL4064397)
Affinity DataIC50: >1.00E+5nM. Assay description: Inhibition of human liver microsomal CYP2E1
Ligand InfoPC cidPC sid
In DepthDetails ArticlePubMed
TargetCytochrome P450 2C19(Homo sapiens (Human))
National Health Research Institutes
Curated by ChEMBL
LigandPNGBDBM50247595(CHEMBL4064397)
Affinity DataIC50: >1.00E+5nM. Assay description: Inhibition of human liver microsomal CYP2C19
Ligand InfoPC cidPC sid
In DepthDetails ArticlePubMed
TargetCytochrome P450 2C9(Homo sapiens (Human))
National Health Research Institutes
Curated by ChEMBL
LigandPNGBDBM50247595(CHEMBL4064397)
Affinity DataIC50: >1.00E+5nM. Assay description: Inhibition of human liver microsomal CYP2C9
Ligand InfoPC cidPC sid
In DepthDetails ArticlePubMed
TargetCytochrome P450 1A2(Homo sapiens (Human))
National Health Research Institutes
Curated by ChEMBL
LigandPNGBDBM50247595(CHEMBL4064397)
Affinity DataIC50: >1.00E+5nM. Assay description: Inhibition of human liver microsomal CYP1A2
Ligand InfoPC cidPC sid
In DepthDetails ArticlePubMed
TargetC-X-C chemokine receptor type 4(Homo sapiens (Human))
National Health Research Institutes
Curated by ChEMBL
LigandPNGBDBM50247595(CHEMBL4064397)
Affinity DataEC50:  14nM. Assay description: Antagonist activity at CXCR4 in human CCRF-CEM cells assessed as inhibition of CXCL12-induced CXCR4+ cell migration pre-incubated for 10 mins before ...
Ligand InfoPC cidPC sid
In DepthDetails ArticlePubMed
TargetCytochrome P450 2D6(Homo sapiens (Human))
National Health Research Institutes
Curated by ChEMBL
LigandPNGBDBM50247595(CHEMBL4064397)
Affinity DataIC50: >1.00E+5nM. Assay description: Inhibition of human liver microsomal CYP2D6
Ligand InfoPC cidPC sid
In DepthDetails ArticlePubMed