BDBM50248496 2-(4-(2-(4-fluorophenyl)-3-(pyridin-4-yl)-1H-indol-6-yl)piperidin-1-yl)ethanol::CHEMBL491503
SMILES OCCN1CCC(CC1)c1ccc2c(c([nH]c2c1)-c1ccc(F)cc1)-c1ccncc1
InChI Key InChIKey=XSXZCGAGBCHSBX-UHFFFAOYSA-N
Data  1 IC50
  Tab Delimited (TSV)   2D SDfile   Computed 3D by Vconf -m prep SDfile
Find this compound or compounds like it in BindingDB:
Activity Spreadsheet -- Enzyme Inhibition Constant Data from BindingDB
Found 1 hit for monomerid = 50248496
TargetcGMP-dependent protein kinase(Eimeria tenella)
Scynexis
Curated by ChEMBL
LigandPNGBDBM50248496(2-(4-(2-(4-fluorophenyl)-3-(pyridin-4-yl)-1H-indol...)
Affinity DataIC50:  0.100nM. Assay description: Inhibition of Eimeria tenella parasite-specific cGMP-dependent protein kinase
In DepthDetails ArticlePubMed