BDBM50249533 CHEMBL4078537
SMILES CCCOc1ccc2n(Cc3cc4OCOc4cc3CC)c(C(O)=O)c(Cc3cccc(c3)-c3nnn[nH]3)c(=O)c2c1
InChI Key InChIKey=MODHKIOUVGRQCC-UHFFFAOYSA-N
Data  2 IC50
  Tab Delimited (TSV)   2D SDfile   Computed 3D by Vconf -m prep SDfile
Find this compound or compounds like it in BindingDB:
Activity Spreadsheet -- Enzyme Inhibition Constant Data from BindingDB
Found 2 hits for monomerid = 50249533
TargetEndothelin receptor type B(Homo sapiens (Human))
St. John'S University
Curated by ChEMBL
LigandPNGBDBM50249533(CHEMBL4078537)
Affinity DataIC50:  803nM. Assay description: Antagonist activity at ETB receptor (unknown origin) expressed in HEK293T cells measured after 30 mins by CCF4-AM dye based GeneBlazer FRET assay
In DepthDetails ArticlePubMed
TargetEndothelin-1 receptor(Homo sapiens (Human))
St. John'S University
Curated by ChEMBL
LigandPNGBDBM50249533(CHEMBL4078537)
Affinity DataIC50:  0.800nM. Assay description: Antagonist activity at ETA receptor (unknown origin) expressed in HEK293T cells measured after 30 mins by CCF4-AM dye based GeneBlazer FRET assay
In DepthDetails ArticlePubMed