BDBM50250216 CHEMBL4086585
SMILES CCc1ccc(OCC(=O)Nc2cccc(c2)C(=O)OC)cc1
InChI Key InChIKey=NHQHUFPZVRJKEV-UHFFFAOYSA-N
Data  2 IC50
  Tab Delimited (TSV)   2D SDfile   Computed 3D by Vconf -m prep SDfile
Find this compound or compounds like it in BindingDB:
Activity Spreadsheet -- Enzyme Inhibition Constant Data from BindingDB
Found 2 hits for monomerid = 50250216
TargetMalate dehydrogenase, mitochondrial(Homo sapiens (Human))
Dongguk University
Curated by ChEMBL
LigandPNGBDBM50250216(CHEMBL4086585)
Affinity DataIC50: >4.00E+4nM. Assay description: Inhibition of human MDH2 after 30 mins by oxaloacetate-dependent NADH oxidation assay
In DepthDetails ArticlePubMed
TargetMalate dehydrogenase, cytoplasmic(Homo sapiens (Human))
Dongguk University
Curated by ChEMBL
LigandPNGBDBM50250216(CHEMBL4086585)
Affinity DataIC50: >4.00E+4nM. Assay description: Inhibition of human MDH1 expressed in Escherichia coli after 30 mins by oxaloacetate-dependent NADH oxidation assay
In DepthDetails ArticlePubMed