BDBM50250217 CHEMBL4095604
SMILES COCCOc1ccc(cc1NC(=O)COc1ccc(cc1)C(C)(C)CC(C)(C)C)C(=O)OC
InChI Key InChIKey=NZDYBPFEUARSQN-UHFFFAOYSA-N
Data  2 IC50
  Tab Delimited (TSV)   2D SDfile   Computed 3D by Vconf -m prep SDfile
Find this compound or compounds like it in BindingDB:
Activity Spreadsheet -- Enzyme Inhibition Constant Data from BindingDB
Found 2 hits for monomerid = 50250217
TargetMalate dehydrogenase, mitochondrial(Homo sapiens (Human))
Dongguk University
Curated by ChEMBL
LigandPNGBDBM50250217(CHEMBL4095604)
Affinity DataIC50:  2.90E+4nM. Assay description: Inhibition of human MDH2 after 30 mins by oxaloacetate-dependent NADH oxidation assay
In DepthDetails ArticlePubMed
TargetMalate dehydrogenase, cytoplasmic(Homo sapiens (Human))
Dongguk University
Curated by ChEMBL
LigandPNGBDBM50250217(CHEMBL4095604)
Affinity DataIC50:  1.84E+4nM. Assay description: Inhibition of human MDH1 expressed in Escherichia coli after 30 mins by oxaloacetate-dependent NADH oxidation assay
In DepthDetails ArticlePubMed