BDBM50250219 CHEMBL4095380
SMILES COC(=O)c1ccc(O)c(NC(=O)C(C)(C)Oc2ccc(cc2)C(C)(C)CC(C)(C)C)c1
InChI Key InChIKey=XNTBPVTVUJMUPY-UHFFFAOYSA-N
Data  2 IC50
  Tab Delimited (TSV)   2D SDfile   Computed 3D by Vconf -m prep SDfile
Find this compound or compounds like it in BindingDB:
Activity Spreadsheet -- Enzyme Inhibition Constant Data from BindingDB
Found 2 hits for monomerid = 50250219
TargetMalate dehydrogenase, cytoplasmic(Homo sapiens (Human))
Dongguk University
Curated by ChEMBL
LigandPNGBDBM50250219(CHEMBL4095380)
Affinity DataIC50:  3.00E+3nM. Assay description: Inhibition of human MDH1 expressed in Escherichia coli after 30 mins by oxaloacetate-dependent NADH oxidation assay
In DepthDetails ArticlePubMed
TargetMalate dehydrogenase, mitochondrial(Homo sapiens (Human))
Dongguk University
Curated by ChEMBL
LigandPNGBDBM50250219(CHEMBL4095380)
Affinity DataIC50:  1.10E+4nM. Assay description: Inhibition of human MDH2 after 30 mins by oxaloacetate-dependent NADH oxidation assay
In DepthDetails ArticlePubMed