BDBM50250231 CHEMBL4068233
SMILES COC(=O)c1ccc(OC)c(NC(=O)COc2ccc(cc2)C(C)(C)CC(C)(C)C)c1
InChI Key InChIKey=MHYUTDIUXARMRO-UHFFFAOYSA-N
Data  3 IC50
  Tab Delimited (TSV)   2D SDfile   Computed 3D by Vconf -m prep SDfile
Find this compound or compounds like it in BindingDB:
Activity Spreadsheet -- Enzyme Inhibition Constant Data from BindingDB
Found 3 hits for monomerid = 50250231
TargetMalate dehydrogenase, mitochondrial(Homo sapiens (Human))
Dongguk University
Curated by ChEMBL
LigandPNGBDBM50250231(CHEMBL4068233)
Affinity DataIC50:  2.75E+4nM. Assay description: Inhibition of human MDH2 after 30 mins by oxaloacetate-dependent NADH oxidation assay
In DepthDetails ArticlePubMed
TargetHypoxia-inducible factor 1-alpha(Homo sapiens (Human))
Dongguk University
Curated by ChEMBL
LigandPNGBDBM50250231(CHEMBL4068233)
Affinity DataIC50: >4.00E+4nM. Assay description: Inhibition of HIF-1alpha in human HCT116 cells incubated for 12 hrs under hypoxic conditions by HRE dual-luciferase reporter gene assay
In DepthDetails ArticlePubMed
TargetMalate dehydrogenase, cytoplasmic(Homo sapiens (Human))
Dongguk University
Curated by ChEMBL
LigandPNGBDBM50250231(CHEMBL4068233)
Affinity DataIC50:  2.27E+3nM. Assay description: Inhibition of human MDH1 expressed in Escherichia coli after 30 mins by oxaloacetate-dependent NADH oxidation assay
In DepthDetails ArticlePubMed