BDBM50250938 CHEMBL4088262
SMILES COc1ccnc2c(F)cc(Nc3nn(cc3C(N)=O)[C@H]3COCC[C@@H]3C#N)cc12
InChI Key InChIKey=VJDLSQUZAIIZIO-BZNIZROVSA-N
Data  6 IC50
  Tab Delimited (TSV)   2D SDfile   Computed 3D by Vconf -m prep SDfile
Find this compound or compounds like it in BindingDB:
Activity Spreadsheet -- Enzyme Inhibition Constant Data from BindingDB
Found 6 hits for monomerid = 50250938
TargetTyrosine-protein kinase JAK1(Homo sapiens (Human))
Merck
Curated by ChEMBL
LigandPNGBDBM50250938(CHEMBL4088262)
Affinity DataIC50:  0.190nM. Assay description: Inhibition of GST-tagged recombinant human JAK1 catalytic domain expressed in baculovirus expression system using LCB-EQEDEPEGDYFEWLW-NH2 as substrat...
In DepthDetails ArticlePubMed
TargetNon-receptor tyrosine-protein kinase TYK2(Homo sapiens (Human))
Merck
Curated by ChEMBL
LigandPNGBDBM50250938(CHEMBL4088262)
Affinity DataIC50:  8nM. Assay description: Inhibition of N-terminal GST-tagged recombinant human TYK2 catalytic domain expressed in baculovirus expression system using LCB-EQEDEPEGDYFEWLW-NH2 ...
In DepthDetails ArticlePubMed
TargetTyrosine-protein kinase JAK1(Homo sapiens (Human))
Merck
Curated by ChEMBL
LigandPNGBDBM50250938(CHEMBL4088262)
Affinity DataIC50:  24nM. Assay description: Displacement of [35S]-MK499 from human ERG expressed in HEK293 cell membranes
In DepthDetails ArticlePubMed
TargetTyrosine-protein kinase JAK3(Homo sapiens (Human))
Merck
Curated by ChEMBL
LigandPNGBDBM50250938(CHEMBL4088262)
Affinity DataIC50: >1.50E+3nM. Assay description: Inhibition of GST-tagged recombinant human JAK3 catalytic domain expressed in baculovirus expression system using LCB-EQEDEPEGDYFEWLW-NH2 as substrat...
In DepthDetails ArticlePubMed
TargetTyrosine-protein kinase JAK2(Homo sapiens (Human))
Merck
Curated by ChEMBL
LigandPNGBDBM50250938(CHEMBL4088262)
Affinity DataIC50:  10nM. Assay description: Inhibition of GST-tagged recombinant human JAK1 catalytic domain expressed in baculovirus expression system using LCB-EQEDEPEGDYFEWLW-NH2 as substrat...
In DepthDetails ArticlePubMed
TargetTyrosine-protein kinase JAK2(Homo sapiens (Human))
Merck
Curated by ChEMBL
LigandPNGBDBM50250938(CHEMBL4088262)
Affinity DataIC50:  2.11E+3nM. Assay description: Inhibition of JAK2 in EPO-stimulated human TF1 cells expressing stably integrated beta-lactamase reporter gene under control of STAT5 response elemen...
In DepthDetails ArticlePubMed