BDBM50252535 5-Fluoro-3-{cis-4-[4-(1H-indol-4-yl)-1-piperazinyl]-cyclohexyl}-1-methyl-1H-indole::CHEMBL522529
SMILES Cn1cc([C@@H]2CC[C@@H](CC2)N2CCN(CC2)c2cccc3[nH]ccc23)c2cc(F)ccc12
InChI Key InChIKey=BKCXSHHVYOXEJX-TYKWCNGQSA-N
Data  2 KI
  Tab Delimited (TSV)   2D SDfile   Computed 3D by Vconf -m prep SDfile
Find this compound or compounds like it in BindingDB:
Activity Spreadsheet -- Enzyme Inhibition Constant Data from BindingDB
Found 2 hits for monomerid = 50252535
TargetSodium-dependent serotonin transporter(Rattus norvegicus (rat))
Wyeth Research
Curated by ChEMBL
LigandPNGBDBM50252535(5-Fluoro-3-{cis-4-[4-(1H-indol-4-yl)-1-piperazinyl...)
Affinity DataKi:  11.6nM. Assay description: Displacement of [3H]paroxetine from rat cortical 5HTT reuptake site
In DepthDetails ArticlePubMed
Target5-hydroxytryptamine receptor 1A(Homo sapiens (Human))
Wyeth Research
Curated by ChEMBL
LigandPNGBDBM50252535(5-Fluoro-3-{cis-4-[4-(1H-indol-4-yl)-1-piperazinyl...)
Affinity DataKi:  124nM. Assay description: Displacement of [3H]8-OH-DPAT from human 5HT1A receptor expressed in CHO cells
In DepthDetails ArticlePubMed