BDBM50253596 2-(5-fluoro-2-(4-fluorophenyl)-1H-indol-3-yl)-2-oxo-N,N-dipropylacetamide::CHEMBL522342
SMILES CCCN(CCC)C(=O)C(=O)c1c([nH]c2ccc(F)cc12)-c1ccc(F)cc1
InChI Key InChIKey=AZWVFRRQZYIRBQ-UHFFFAOYSA-N
Data  1 KI
  Tab Delimited (TSV)   2D SDfile   Computed 3D by Vconf -m prep SDfile
Find this compound or compounds like it in BindingDB:
Activity Spreadsheet -- Enzyme Inhibition Constant Data from BindingDB
Found 1 hit for monomerid = 50253596
TargetTranslocator protein(Rattus norvegicus (rat))
Universit£
Curated by ChEMBL
LigandPNGBDBM50253596(2-(5-fluoro-2-(4-fluorophenyl)-1H-indol-3-yl)-2-ox...)
Affinity DataKi:  6.73nM. Assay description: Displacement of [3H]PK11195 from translocator protein in rat kidney mitochondrial membrane
In DepthDetails ArticlePubMed