BDBM50253917 1-(2,4-Dichlorophenyl)-5-(5-(hex-1-ynyl)thiophen-2-yl)-4-methyl-N-(piperidin-1-yl)-1H-pyrazole-3-carboxamide::CHEMBL461428
SMILES CCCCC#Cc1ccc(s1)-c1c(C)c(nn1-c1ccc(Cl)cc1Cl)C(=O)NN1CCCCC1
InChI Key InChIKey=PGENRRWCNZXZQN-UHFFFAOYSA-N
Data  2 IC50  1 EC50
  Tab Delimited (TSV)   2D SDfile   Computed 3D by Vconf -m prep SDfile
Find this compound or compounds like it in BindingDB:
Activity Spreadsheet -- Enzyme Inhibition Constant Data from BindingDB
Found 3 hits for monomerid = 50253917
TargetCannabinoid receptor 1(Homo sapiens (Human))
National Health Research Institutes
Curated by ChEMBL
LigandPNGBDBM50253917(1-(2,4-Dichlorophenyl)-5-(5-(hex-1-ynyl)thiophen-2...)
Affinity DataIC50:  1.40nM. Assay description: Displacement of [3H]CP55940 from human CB1 receptor expressed in HEK293 cells
In DepthDetails ArticlePubMed
TargetCannabinoid receptor 1(Homo sapiens (Human))
National Health Research Institutes
Curated by ChEMBL
LigandPNGBDBM50253917(1-(2,4-Dichlorophenyl)-5-(5-(hex-1-ynyl)thiophen-2...)
Affinity DataEC50:  7.90nM. Assay description: Antagonist activity at human CB1 receptor expressed in HEK293 cells assessed as inhibition of Eu-GTP binding
In DepthDetails ArticlePubMed
TargetCannabinoid receptor 2(Homo sapiens (Human))
National Health Research Institutes
Curated by ChEMBL
LigandPNGBDBM50253917(1-(2,4-Dichlorophenyl)-5-(5-(hex-1-ynyl)thiophen-2...)
Affinity DataIC50:  311nM. Assay description: Displacement of [3H]CP55940 from human CB2 receptor expressed in HEK293 cells
In DepthDetails ArticlePubMed