BDBM50254363 CHEMBL4103324
SMILES Nc1nc2n(Cc3ccc(cc3)C3(N=N3)C(F)(F)F)ncc2c2nc(nn12)-c1ccco1
InChI Key InChIKey=VAYQKEYCXMQZCA-UHFFFAOYSA-N
Data  1 KI
  Tab Delimited (TSV)   2D SDfile   Computed 3D by Vconf -m prep SDfile
Find this compound or compounds like it in BindingDB:
Activity Spreadsheet -- Enzyme Inhibition Constant Data from BindingDB
Found 1 hit for monomerid = 50254363
TargetAdenosine receptor A2a(Homo sapiens (Human))
Kissei Pharmaceutical
Curated by ChEMBL
LigandPNGBDBM50254363(CHEMBL4103324)
Affinity DataKi:  1.52E+3nM. Assay description: Displacement of MRS5346 from C-terminal 10xHis and 1D4-tagged C-terminal-truncated human A2A adenosine receptor (1 to 316 residues) expressed in Pich...
In DepthDetails ArticlePubMed