BDBM50254368 (+/-)-3-[3-[4-(2-Amino-ethyl)-piperidin-1-yl]-2-(4'-ethyl-biphenyl-3-sulfonylamino)-3-oxo-propyl]-benzamidine::CHEMBL460810
SMILES CCc1ccc(cc1)-c1cccc(c1)S(=O)(=O)NC(Cc1cccc(c1)C(N)=N)C(=O)N1CCC(CCN)CC1
InChI Key InChIKey=QBIQHSJYZKKJPJ-UHFFFAOYSA-N
Data  5 KI
  Tab Delimited (TSV)   2D SDfile   Computed 3D by Vconf -m prep SDfile
Find this compound or compounds like it in BindingDB:
Activity Spreadsheet -- Enzyme Inhibition Constant Data from BindingDB
Found 5 hits for monomerid = 50254368
TargetSuppressor of tumorigenicity 14 protein(Homo sapiens (Human))
Curacyte Discovery
Curated by ChEMBL
LigandPNGBDBM50254368((+/-)-3-[3-[4-(2-Amino-ethyl)-piperidin-1-yl]-2-(4...)
Affinity DataKi:  2.5nM. Assay description: Inhibition of matriptase (unknown origin)
In DepthDetails ArticlePubMed
TargetProthrombin(Homo sapiens (Human))
Curacyte Discovery
Curated by ChEMBL
LigandPNGBDBM50254368((+/-)-3-[3-[4-(2-Amino-ethyl)-piperidin-1-yl]-2-(4...)
Affinity DataKi:  33nM. Assay description: Inhibition of thrombin (unknown origin)
In DepthDetails ArticlePubMed
TargetPlasminogen(Homo sapiens (Human))
Curacyte Discovery
Curated by ChEMBL
LigandPNGBDBM50254368((+/-)-3-[3-[4-(2-Amino-ethyl)-piperidin-1-yl]-2-(4...)
Affinity DataKi:  214nM. Assay description: Inhibition of plasmin (unknown origin)
In DepthDetails ArticlePubMed
TargetCoagulation factor X(Homo sapiens (Human))
Curacyte Discovery
Curated by ChEMBL
LigandPNGBDBM50254368((+/-)-3-[3-[4-(2-Amino-ethyl)-piperidin-1-yl]-2-(4...)
Affinity DataKi:  630nM. Assay description: Inhibition of factor 10a (unknown origin)
In DepthDetails ArticlePubMed
TargetUrokinase-type plasminogen activator(Homo sapiens (Human))
Curacyte Discovery
Curated by ChEMBL
LigandPNGBDBM50254368((+/-)-3-[3-[4-(2-Amino-ethyl)-piperidin-1-yl]-2-(4...)
Affinity DataKi:  6.90E+3nM. Assay description: Inhibition of uPA (unknown origin)
In DepthDetails ArticlePubMed